Reaction Details
TargetMetabotropic glutamate receptor 1
LigandBDBM50436506
Substrate/Competitorn/a
Meas. Tech.ChEMBL_966646 (CHEMBL2399851)
IC50 98±n/a nM
Citation Lovell, KMFelts, ASRodriguez, ALVenable, DFCho, HPMorrison, RDByers, FWDaniels, JSNiswender, CMConn, PJLindsley, CWEmmitte, KA N-Acyl-N'-arylpiperazines as negative allosteric modulators of mGlu1: identification of VU0469650, a potent and selective tool compound with CNS exposure in rats. Bioorg Med Chem Lett23:3713-8 (2013) 
 
Metabotropic glutamate receptor 1
Name:Metabotropic glutamate receptor 1
Type:Enzyme
Mol. Mass.:132358.19
Organism:Homo sapiens (Human)
Description:Q13255
Residue:1194
BDBM50436506
NameBDBM50436506
Synonyms:CHEMBL2397347
TypeSmall organic molecule
Emp. Form.C22H28N4O
Mol. Mass.364.4839
SMILESC[C@@H]1CN(CCN1C(=O)C12CC3CC(CC(C3)C1)C2)c1cccnc1C#N