Reaction Details
TargetHistamine H2 receptor
LigandBDBM50292604
Substrate/Competitorn/a
Meas. Tech.ChEMBL_969180 (CHEMBL2404437)
Ki 1400±n/a nM
Citation Darvesh, SMacdonald, IRMartin, E Selectivity of phenothiazine cholinesterase inhibitors for neurotransmitter systems. Bioorg Med Chem Lett23:3822-5 (2013) 
 
Histamine H2 receptor
Name:Histamine H2 receptor
Type:G Protein-Coupled Receptor (GPCR)
Mol. Mass.:40115.31
Organism:Homo sapiens (Human)
Description:n/a
Residue:359
BDBM50292604
NameBDBM50292604
Synonyms:3-(diethylamino)propyl 10H-phenothiazine-10-carboxylate | CHEMBL519609
TypeSmall organic molecule
Emp. Form.C20H24N2O2S
Mol. Mass.356.482
SMILESCCN(CC)CCCOC(=O)N1c2ccccc2Sc2ccccc12