Reaction Details
TargetP2Y purinoceptor 1
LigandBDBM50436910
Substrate/Competitorn/a
Meas. Tech.ChEMBL_971691 (CHEMBL2404230)
Ki 6.0±n/a nM
Citation Pi, ZSutton, JLloyd, JHua, JPrice, LWu, QChang, MZheng, JRehfuss, RHuang, CSWexler, RRLam, PY 2-Aminothiazole based P2Y(1) antagonists as novel antiplatelet agents. Bioorg Med Chem Lett23:4206-9 (2013) 
 
P2Y purinoceptor 1
Name:P2Y purinoceptor 1
Type:Enzyme
Mol. Mass.:42090.25
Organism:Homo sapiens (Human)
Description:P47900
Residue:373
BDBM50436910
NameBDBM50436910
Synonyms:CHEMBL2401853
TypeSmall organic molecule
Emp. Form.C22H20F3N5O2S
Mol. Mass.475.487
SMILESCc1noc(n1)-c1sc(Nc2cccnc2Oc2ccccc2C(C)(C)C)nc1C(F)(F)F