Reaction Details
TargetP2Y purinoceptor 1
LigandBDBM50436918
Substrate/Competitorn/a
Meas. Tech.ChEMBL_971691 (CHEMBL2404230)
Ki 12±n/a nM
Citation Pi, ZSutton, JLloyd, JHua, JPrice, LWu, QChang, MZheng, JRehfuss, RHuang, CSWexler, RRLam, PY 2-Aminothiazole based P2Y(1) antagonists as novel antiplatelet agents. Bioorg Med Chem Lett23:4206-9 (2013) 
 
P2Y purinoceptor 1
Name:P2Y purinoceptor 1
Type:Enzyme
Mol. Mass.:42090.25
Organism:Homo sapiens (Human)
Description:P47900
Residue:373
BDBM50436918
NameBDBM50436918
Synonyms:CHEMBL2401798
TypeSmall organic molecule
Emp. Form.C26H27N3OS
Mol. Mass.429.577
SMILESCCc1nc(Nc2cccnc2Oc2ccccc2C(C)(C)C)sc1-c1ccccc1