Reaction Details
TargetPlatelet-derived growth factor receptor alpha
LigandBDBM50437053
Substrate/Competitorn/a
Meas. Tech.ChEMBL_972079 (CHEMBL2406183)
IC50 13±n/a nM
Citation Troxler, TGreenidge, PZimmermann, KDesrayaud, SDrückes, PSchweizer, TStauffer, DRovelli, GShimshek, DR Discovery of novel indolinone-based, potent, selective and brain penetrant inhibitors of LRRK2. Bioorg Med Chem Lett23:4085-90 (2013) 
 
Platelet-derived growth factor receptor alpha
Name:Platelet-derived growth factor receptor alpha
Type:Protein
Mol. Mass.:122633.38
Organism:Homo sapiens (Human)
Description:P16234
Residue:1089
BDBM50437053
NameBDBM50437053
Synonyms:CHEMBL2403373
TypeSmall organic molecule
Emp. Form.C27H34N6O3
Mol. Mass.490.5973
SMILESCN1CCC(CC1)Nc1ccc2NC(=O)\C(=C/c3cc4CN(CCc4[nH]3)C(=O)N3CCOCC3)c2c1