Reaction Details
TargetALK tyrosine kinase receptor
LigandBDBM50437053
Substrate/Competitorn/a
Meas. Tech.ChEMBL_972080 (CHEMBL2406184)
IC50 76±n/a nM
Citation Troxler, TGreenidge, PZimmermann, KDesrayaud, SDrückes, PSchweizer, TStauffer, DRovelli, GShimshek, DR Discovery of novel indolinone-based, potent, selective and brain penetrant inhibitors of LRRK2. Bioorg Med Chem Lett23:4085-90 (2013) 
 
ALK tyrosine kinase receptor
Name:ALK tyrosine kinase receptor
Type:Protein
Mol. Mass.:176453.10
Organism:Homo sapiens (Human)
Description:Q9UM73
Residue:1620
BDBM50437053
NameBDBM50437053
Synonyms:CHEMBL2403373
TypeSmall organic molecule
Emp. Form.C27H34N6O3
Mol. Mass.490.5973
SMILESCN1CCC(CC1)Nc1ccc2NC(=O)\C(=C/c3cc4CN(CCc4[nH]3)C(=O)N3CCOCC3)c2c1