Reaction Details
TargetLeucine-rich repeat serine/threonine-protein kinase 2
LigandBDBM50437051
Substrate/Competitorn/a
Meas. Tech.ChEMBL_972082 (CHEMBL2406186)
IC50 4.0±n/a nM
Citation Troxler, TGreenidge, PZimmermann, KDesrayaud, SDrückes, PSchweizer, TStauffer, DRovelli, GShimshek, DR Discovery of novel indolinone-based, potent, selective and brain penetrant inhibitors of LRRK2. Bioorg Med Chem Lett23:4085-90 (2013) 
 
Leucine-rich repeat serine/threonine-protein kinase 2
Name:Leucine-rich repeat serine/threonine-protein kinase 2
Type:Protein
Mol. Mass.:286113.20
Organism:Homo sapiens (Human)
Description:Q5S007
Residue:2527
BDBM50437051
NameBDBM50437051
Synonyms:CHEMBL2403375
TypeSmall organic molecule
Emp. Form.C21H23N3O3
Mol. Mass.365.4256
SMILESCC(C)Oc1ccc2NC(=O)\C(=C/c3cc4CN(CCc4[nH]3)C(C)=O)c2c1