Reaction Details
TargetLeucine-rich repeat serine/threonine-protein kinase 2
LigandBDBM50437052
Substrate/Competitorn/a
Meas. Tech.ChEMBL_972082 (CHEMBL2406186)
IC50 4.0±n/a nM
Citation Troxler, TGreenidge, PZimmermann, KDesrayaud, SDrückes, PSchweizer, TStauffer, DRovelli, GShimshek, DR Discovery of novel indolinone-based, potent, selective and brain penetrant inhibitors of LRRK2. Bioorg Med Chem Lett23:4085-90 (2013) 
 
Leucine-rich repeat serine/threonine-protein kinase 2
Name:Leucine-rich repeat serine/threonine-protein kinase 2
Type:Protein
Mol. Mass.:286113.20
Organism:Homo sapiens (Human)
Description:Q5S007
Residue:2527
BDBM50437052
NameBDBM50437052
Synonyms:CHEMBL2403374
TypeSmall organic molecule
Emp. Form.C23H25N5O4
Mol. Mass.435.4757
SMILESCC(=O)Nc1ccc2NC(=O)\C(=C/c3cc4CN(CCc4[nH]3)C(=O)N3CCOCC3)c2c1