Reaction Details
TargetProto-oncogene tyrosine-protein kinase receptor Ret
LigandBDBM50437053
Substrate/Competitorn/a
Meas. Tech.ChEMBL_972076 (CHEMBL2406180)
IC50 5.0±n/a nM
Citation Troxler, TGreenidge, PZimmermann, KDesrayaud, SDrückes, PSchweizer, TStauffer, DRovelli, GShimshek, DR Discovery of novel indolinone-based, potent, selective and brain penetrant inhibitors of LRRK2. Bioorg Med Chem Lett23:4085-90 (2013) 
 
Proto-oncogene tyrosine-protein kinase receptor Ret
Name:Proto-oncogene tyrosine-protein kinase receptor Ret
Type:Protein
Mol. Mass.:124318.29
Organism:Homo sapiens (Human)
Description:P07949
Residue:1114
BDBM50437053
NameBDBM50437053
Synonyms:CHEMBL2403373
TypeSmall organic molecule
Emp. Form.C27H34N6O3
Mol. Mass.490.5973
SMILESCN1CCC(CC1)Nc1ccc2NC(=O)\C(=C/c3cc4CN(CCc4[nH]3)C(=O)N3CCOCC3)c2c1