Reaction Details
TargetAdenosine receptor A3
LigandBDBM50437188
Substrate/Competitorn/a
Meas. Tech.ChEMBL_969851 (CHEMBL2404651)
Ki 9.7±n/a nM
Citation Paoletta, STosh, DKFinley, AGizewski, ETMoss, SMGao, ZGAuchampach, JASalvemini, DJacobson, KA Rational design of sulfonated A3 adenosine receptor-selective nucleosides as pharmacological tools to study chronic neuropathic pain. J Med Chem56:5949-63 (2014) 
 
Adenosine receptor A3
Name:Adenosine receptor A3
Type:PROTEIN
Mol. Mass.:36460.91
Organism:Mus musculus
Description:ChEMBL_1515686
Residue:319
BDBM50437188
NameBDBM50437188
Synonyms:CHEMBL2401954
TypeSmall organic molecule
Emp. Form.C28H25ClN6O6S
Mol. Mass.609.053
SMILESCNC(=O)[C@@]12C[C@@H]1[C@H]([C@H](O)[C@@H]2O)n1cnc2c(NCc3cccc(Cl)c3)nc(nc12)C#Cc1ccc(cc1)S(O)(=O)=O