Reaction Details
TargetBotulinum neurotoxin type A
LigandBDBM50067697
Substrate/Competitorn/a
Meas. Tech.ChEMBL_969521 (CHEMBL2406032)
IC50 26±n/a nM
Citation Opsenica, IMTot, MGomba, LNuss, JESciotti, RJBavari, SBurnett, JCSolaja, BA 4-Amino-7-chloroquinolines: probing ligand efficiency provides botulinum neurotoxin serotype A light chain inhibitors with significant antiprotozoal activity. J Med Chem56:5860-71 (2014) 
 
Botulinum neurotoxin type A
Name:Botulinum neurotoxin type A
Type:PROTEIN
Mol. Mass.:149450.01
Organism:Clostridium botulinum
Description:ChEMBL_1510137
Residue:1296
BDBM50067697
NameBDBM50067697
Synonyms:7-chloro-N-(3-(3-(7-chloroquinolin-4-ylamino)propylamino)propyl)quinolin-4-amine N-(7-Chloro-quinolin-4-yl)-N'-[3-(7-chloro-quinolin-4-ylamino)-propyl]-propane-1,3-diamine | N1-(7-chloroquinolin-4-yl)-N3-(3-(7-chloroquinolin-4-ylamino)propyl)propane-1,3-diamine
TypeSmall organic molecule
Emp. Form.C24H25Cl2N5
Mol. Mass.454.395
SMILESClc1ccc2c(NCCCNCCCNc3ccnc4cc(Cl)ccc34)ccnc2c1