Reaction Details
TargetP2X purinoceptor 7
LigandBDBM50437329
Substrate/Competitorn/a
Meas. Tech.ChEMBL_972155 (CHEMBL2411084)
IC50 7700±n/a nM
Citation Battilocchio, CGuetzoyan, LCervetto, CDi Cesare Mannelli, LFrattaroli, DBaxendale, IRMaura, GRossi, ASautebin, LBiava, MGhelardini, CMarcoli, MLey, SV Flow Synthesis and Biological Studies of an Analgesic Adamantane Derivative That Inhibits P2X7-Evoked Glutamate Release. ACS Med Chem Lett4:704-9 (2013) 
 
P2X purinoceptor 7
Name:P2X purinoceptor 7
Type:Protein
Mol. Mass.:68403.50
Organism:Rattus norvegicus (Rat)
Description:Q64663
Residue:595
BDBM50437329
NameBDBM50437329
Synonyms:CHEMBL2407630
TypeSmall organic molecule
Emp. Form.C21H26N2O2
Mol. Mass.338.4433
SMILESO=C(NC1(C2CC3CC(C2)CC1C3)C(=O)NC1CC1)c1ccccc1