Reaction Details
TargetDiacylglycerol O-acyltransferase 1
LigandBDBM50437392
Substrate/Competitorn/a
Meas. Tech.ChEMBL_972632 (CHEMBL2410612)
IC50 4.4±n/a nM
Citation He, SHong, QLai, ZWu, ZYu, YKim, DWTing, PCKuethe, JTYang, GXJian, TLiu, JGuiadeen, DKrikorian, ADSperbeck, DMSonatore, LMWiltsie, JChung, CCGibson, JTLisnock, JMurphy, BAGorski, JNLiu, JChen, DChen, XWolff, MTong, SXMadeira, MKaranam, BVShen, DMBalkovec, JMPinto, SNargund, RPDeVita, RJ Potent DGAT1 Inhibitors in the Benzimidazole Class with a Pyridyl-oxy-cyclohexanecarboxylic Acid Moiety. ACS Med Chem Lett4:773-8 (2013) 
 
Diacylglycerol O-acyltransferase 1
Name:Diacylglycerol O-acyltransferase 1
Type:Enzyme
Mol. Mass.:56810.61
Organism:Mus musculus (mouse)
Description:In this assay, recombinant mouse DGAT-1 containing an N-terminal His6-epitope tag was produced in the baculovirus expression system.
Residue:498
BDBM50437392
NameBDBM50437392
Synonyms:CHEMBL2408631
TypeSmall organic molecule
Emp. Form.C25H21F3N4O3
Mol. Mass.482.4544
SMILESOC(=O)[C@H]1CC[C@@H](CC1)Oc1ccc(cn1)-c1ccc(cn1)-c1nc2ccc(cc2[nH]1)C(F)(F)F