Reaction Details
TargetSerine/threonine-protein kinase PLK3
LigandBDBM50437855
Substrate/Competitorn/a
Meas. Tech.ChEMBL_973990 (CHEMBL2410315)
IC50>10000±n/a nM
Citation Laufer, RForrest, BLi, SWLiu, YSampson, PEdwards, LLang, YAwrey, DEMao, GPlotnikova, OLeung, GHodgson, RBeletskaya, IMason, JMLuo, XWei, XYao, YFeher, MBan, FKiarash, RGreen, EMak, TWPan, GPauls, HW The discovery of PLK4 inhibitors: (E)-3-((1H-Indazol-6-yl)methylene)indolin-2-ones as novel antiproliferative agents. J Med Chem56:6069-87 (2013) 
 
Serine/threonine-protein kinase PLK3
Name:Serine/threonine-protein kinase PLK3
Type:Serine/threonine-protein kinase
Mol. Mass.:71655.17
Organism:Homo sapiens (Human)
Description:Enzyme assays were using PLK3 purified from baculovirus-infected Trichoplusia ni cells expressing full-length PLK3.
Residue:646
BDBM50437855
NameBDBM50437855
Synonyms:CHEMBL2407915
TypeSmall organic molecule
Emp. Form.C16H10ClN3O
Mol. Mass.295.723
SMILESClc1ccc2\C(=C/c3ccc4cn[nH]c4c3)C(=O)Nc2c1