Reaction Details
TargetSerine/threonine-protein kinase PLK1
LigandBDBM50437849
Substrate/Competitorn/a
Meas. Tech.ChEMBL_973991 (CHEMBL2410316)
IC50>10000±n/a nM
Citation Laufer, RForrest, BLi, SWLiu, YSampson, PEdwards, LLang, YAwrey, DEMao, GPlotnikova, OLeung, GHodgson, RBeletskaya, IMason, JMLuo, XWei, XYao, YFeher, MBan, FKiarash, RGreen, EMak, TWPan, GPauls, HW The discovery of PLK4 inhibitors: (E)-3-((1H-Indazol-6-yl)methylene)indolin-2-ones as novel antiproliferative agents. J Med Chem56:6069-87 (2013) 
 
Serine/threonine-protein kinase PLK1
Name:Serine/threonine-protein kinase PLK1
Type:Serine/threonine-protein kinase
Mol. Mass.:68277.16
Organism:Homo sapiens (Human)
Description:P53350
Residue:603
BDBM50437849
NameBDBM50437849
Synonyms:CHEMBL2407748
TypeSmall organic molecule
Emp. Form.C24H18N4O2
Mol. Mass.394.4253
SMILESCOc1ccc2NC(=O)\C(=C\c3ccc4c(\C=C\c5cccnc5)n[nH]c4c3)c2c1