Reaction Details
TargetSerine/threonine-protein kinase PLK4
LigandBDBM50437848
Substrate/Competitorn/a
Meas. Tech.ChEMBL_973993 (CHEMBL2410318)
IC50 2.3±n/a nM
Citation Laufer, RForrest, BLi, SWLiu, YSampson, PEdwards, LLang, YAwrey, DEMao, GPlotnikova, OLeung, GHodgson, RBeletskaya, IMason, JMLuo, XWei, XYao, YFeher, MBan, FKiarash, RGreen, EMak, TWPan, GPauls, HW The discovery of PLK4 inhibitors: (E)-3-((1H-Indazol-6-yl)methylene)indolin-2-ones as novel antiproliferative agents. J Med Chem56:6069-87 (2013) 
 
Serine/threonine-protein kinase PLK4
Name:Serine/threonine-protein kinase PLK4
Type:PROTEIN
Mol. Mass.:108996.91
Organism:Homo sapiens (Human)
Description:ChEMBL_1474078
Residue:970
BDBM50437848
NameBDBM50437848
Synonyms:CHEMBL2407750
TypeSmall organic molecule
Emp. Form.C23H15ClN4O
Mol. Mass.398.844
SMILESClc1ccc2NC(=O)\C(=C\c3ccc4c(\C=C\c5ccncc5)n[nH]c4c3)c2c1