Reaction Details
TargetSerine/threonine-protein kinase PLK4
LigandBDBM50437868
Substrate/Competitorn/a
Meas. Tech.ChEMBL_973993 (CHEMBL2410318)
IC50 860±n/a nM
Citation Laufer, RForrest, BLi, SWLiu, YSampson, PEdwards, LLang, YAwrey, DEMao, GPlotnikova, OLeung, GHodgson, RBeletskaya, IMason, JMLuo, XWei, XYao, YFeher, MBan, FKiarash, RGreen, EMak, TWPan, GPauls, HW The discovery of PLK4 inhibitors: (E)-3-((1H-Indazol-6-yl)methylene)indolin-2-ones as novel antiproliferative agents. J Med Chem56:6069-87 (2013) 
 
Serine/threonine-protein kinase PLK4
Name:Serine/threonine-protein kinase PLK4
Type:PROTEIN
Mol. Mass.:108996.91
Organism:Homo sapiens (Human)
Description:ChEMBL_1474078
Residue:970
BDBM50437868
NameBDBM50437868
Synonyms:CHEMBL2407903
TypeSmall organic molecule
Emp. Form.C16H11BrClNO3
Mol. Mass.380.62
SMILESCOc1cc(\C=C2/C(=O)Nc3ccc(Br)cc23)cc(Cl)c1O