Reaction Details
TargetSerine/threonine-protein kinase PLK4
LigandBDBM50437870
Substrate/Competitorn/a
Meas. Tech.ChEMBL_973953 (CHEMBL2410100)
Ki 25±n/a nM
Citation Laufer, RForrest, BLi, SWLiu, YSampson, PEdwards, LLang, YAwrey, DEMao, GPlotnikova, OLeung, GHodgson, RBeletskaya, IMason, JMLuo, XWei, XYao, YFeher, MBan, FKiarash, RGreen, EMak, TWPan, GPauls, HW The discovery of PLK4 inhibitors: (E)-3-((1H-Indazol-6-yl)methylene)indolin-2-ones as novel antiproliferative agents. J Med Chem56:6069-87 (2013) 
 
Serine/threonine-protein kinase PLK4
Name:Serine/threonine-protein kinase PLK4
Type:PROTEIN
Mol. Mass.:108996.91
Organism:Homo sapiens (Human)
Description:ChEMBL_1474078
Residue:970
BDBM50437870
NameBDBM50437870
Synonyms:CHEMBL2407901
TypeSmall organic molecule
Emp. Form.C23H30N6O4
Mol. Mass.454.5221
SMILESCOCCOc1ccc2Nc3ncnc4[nH]cc(CN(C)CCCN(C)C(=O)COc1c2)c34