Reaction Details
TargetSerine/threonine-protein kinase PLK4
LigandBDBM50426474
Substrate/Competitorn/a
Meas. Tech.ChEMBL_973953 (CHEMBL2410100)
Ki 11±n/a nM
Citation Laufer, RForrest, BLi, SWLiu, YSampson, PEdwards, LLang, YAwrey, DEMao, GPlotnikova, OLeung, GHodgson, RBeletskaya, IMason, JMLuo, XWei, XYao, YFeher, MBan, FKiarash, RGreen, EMak, TWPan, GPauls, HW The discovery of PLK4 inhibitors: (E)-3-((1H-Indazol-6-yl)methylene)indolin-2-ones as novel antiproliferative agents. J Med Chem56:6069-87 (2013) 
 
Serine/threonine-protein kinase PLK4
Name:Serine/threonine-protein kinase PLK4
Type:PROTEIN
Mol. Mass.:108996.91
Organism:Homo sapiens (Human)
Description:ChEMBL_1474078
Residue:970
BDBM50426474
NameBDBM50426474
Synonyms:CHEMBL1980391
TypeSmall organic molecule
Emp. Form.C18H14ClFN4O
Mol. Mass.356.781
SMILESCOc1cc2Nc3[nH]nc(C)c3N=C(c3ccccc3Cl)c2cc1F