Reaction Details
TargetAlkaline phosphatase, tissue-nonspecific isozyme
LigandBDBM50437935
Substrate/Competitorn/a
Meas. Tech.ChEMBL_972806 (CHEMBL2411274)
Ki 130±n/a nM
Citation al-Rashida, MRaza, RAbbas, GShah, MSKostakis, GELecka, JSévigny, JMuddassar, MPapatriantafyllopoulou, CIqbal, J Identification of novel chromone based sulfonamides as highly potent and selective inhibitors of alkaline phosphatases. Eur J Med Chem66:438-49 (2013) 
 
Alkaline phosphatase, tissue-nonspecific isozyme
Name:Alkaline phosphatase, tissue-nonspecific isozyme
Type:Protein
Mol. Mass.:57195.60
Organism:Bos taurus (Cattle)
Description:P09487
Residue:524
BDBM50437935
NameBDBM50437935
Synonyms:CHEMBL2408701
TypeSmall organic molecule
Emp. Form.C16H11BrN2O4S
Mol. Mass.407.239
SMILESBrc1ccc2occ(C3Nc4ccccc4S(=O)(=O)N3)c(=O)c2c1