Reaction Details
TargetIntestinal-type alkaline phosphatase
LigandBDBM50437934
Substrate/Competitorn/a
Meas. Tech.ChEMBL_972808 (CHEMBL2411276)
Ki 200±n/a nM
Citation al-Rashida, MRaza, RAbbas, GShah, MSKostakis, GELecka, JSévigny, JMuddassar, MPapatriantafyllopoulou, CIqbal, J Identification of novel chromone based sulfonamides as highly potent and selective inhibitors of alkaline phosphatases. Eur J Med Chem66:438-49 (2013) 
 
Intestinal-type alkaline phosphatase
Name:Intestinal-type alkaline phosphatase
Type:Protein
Mol. Mass.:57094.82
Organism:Bos taurus (Cattle)
Description:P19111
Residue:533
BDBM50437934
NameBDBM50437934
Synonyms:CHEMBL2408702
TypeSmall organic molecule
Emp. Form.C18H16Br2N2O5S
Mol. Mass.532.203
SMILESCCOC1Oc2c(Br)cc(Br)cc2C(=O)C1=CNc1ccccc1S(N)(=O)=O