Reaction Details
TargetIntestinal-type alkaline phosphatase
LigandBDBM50437947
Substrate/Competitorn/a
Meas. Tech.ChEMBL_972808 (CHEMBL2411276)
Ki 90600±n/a nM
Citation al-Rashida, MRaza, RAbbas, GShah, MSKostakis, GELecka, JSévigny, JMuddassar, MPapatriantafyllopoulou, CIqbal, J Identification of novel chromone based sulfonamides as highly potent and selective inhibitors of alkaline phosphatases. Eur J Med Chem66:438-49 (2013) 
 
Intestinal-type alkaline phosphatase
Name:Intestinal-type alkaline phosphatase
Type:Protein
Mol. Mass.:57094.82
Organism:Bos taurus (Cattle)
Description:P19111
Residue:533
BDBM50437947
NameBDBM50437947
Synonyms:CHEMBL1814391
TypeSmall organic molecule
Emp. Form.C18H18N2O5S
Mol. Mass.374.411
SMILESCCOC1Oc2ccccc2C(=O)C1=CNc1ccc(cc1)S(N)(=O)=O