Reaction Details
TargetG protein-activated inward rectifier potassium channel 1
LigandBDBM50437960
Substrate/Competitorn/a
Meas. Tech.ChEMBL_972869 (CHEMBL2411646)
IC50 950±n/a nM
Citation Wen, WWu, WRomaine, IMKaufmann, KDu, YSulikowski, GAWeaver, CDLindsley, CW Discovery of 'molecular switches' within a GIRK activator scaffold that afford selective GIRK inhibitors. Bioorg Med Chem Lett23:4562-6 (2013) 
 
G protein-activated inward rectifier potassium channel 1
Name:G protein-activated inward rectifier potassium channel 1
Type:PROTEIN
Mol. Mass.:56610.74
Organism:Homo sapiens (Human)
Description:ChEMBL_107915
Residue:501
BDBM50437960
NameBDBM50437960
Synonyms:CHEMBL2409122
TypeSmall organic molecule
Emp. Form.C20H20N4OS
Mol. Mass.364.464
SMILESCSc1cccc(NC(=O)Nc2cc(nn2-c2ccccc2)C2CC2)c1