Reaction Details
TargetG protein-activated inward rectifier potassium channel 1/4
LigandBDBM50437968
Substrate/Competitorn/a
Meas. Tech.ChEMBL_972874 (CHEMBL2411651)
EC50 3500±n/a nM
Citation Wen, WWu, WRomaine, IMKaufmann, KDu, YSulikowski, GAWeaver, CDLindsley, CW Discovery of 'molecular switches' within a GIRK activator scaffold that afford selective GIRK inhibitors. Bioorg Med Chem Lett23:4562-6 (2013) 
 
G protein-activated inward rectifier potassium channel 1/4
Name:G protein-activated inward rectifier potassium channel 1/4
Type:PROTEIN
Mol. Mass.:n/a
Description:n/a
Components:This complex has 2 components.
Component 1
Name:G protein-activated inward rectifier potassium channel 1
Synonyms:GIRK-1 Inward rectifier K(+) channel Kir3.1 KCNJ3_HUMAN | Potassium channel, inwardly rectifying subfamily J member 3
Type:PROTEIN
Mol. Mass.:56610.74
Organism:Homo sapiens (Human)
Description:ChEMBL_107915
Residue:501
Component 2
Name:G protein-activated inward rectifier potassium channel 4
Synonyms:CIR GIRK-4 Heart KATP channel Inward rectifier K(+) channel Kir3.4 KCNJ5 Potassium channel, inwardly rectifying subfamily J member 5
Type:PROTEIN
Mol. Mass.:47658.06
Organism:Homo sapiens (Human)
Description:ChEMBL_107914
Residue:419
BDBM50437968
NameBDBM50437968
Synonyms:CHEMBL2409134
TypeSmall organic molecule
Emp. Form.C21H21F3N4O
Mol. Mass.402.4128
SMILESCC(C)c1cc(NC(=O)Nc2cccc(c2)C(F)(F)F)n(Cc2ccccc2)n1