Reaction Details
TargetG protein-activated inward rectifier potassium channel 4
LigandBDBM50437969
Substrate/Competitorn/a
Meas. Tech.ChEMBL_972874 (CHEMBL2411651)
EC50 1700±n/a nM
Citation Wen, WWu, WRomaine, IMKaufmann, KDu, YSulikowski, GAWeaver, CDLindsley, CW Discovery of 'molecular switches' within a GIRK activator scaffold that afford selective GIRK inhibitors. Bioorg Med Chem Lett23:4562-6 (2013) 
 
G protein-activated inward rectifier potassium channel 4
Name:G protein-activated inward rectifier potassium channel 4
Type:PROTEIN
Mol. Mass.:47658.06
Organism:Homo sapiens (Human)
Description:ChEMBL_107914
Residue:419
BDBM50437969
NameBDBM50437969
Synonyms:CHEMBL2409133
TypeSmall organic molecule
Emp. Form.C20H21ClN4O
Mol. Mass.368.86
SMILESCC(C)c1cc(NC(=O)Nc2cccc(Cl)c2)n(Cc2ccccc2)n1