Reaction Details
TargetG protein-activated inward rectifier potassium channel 1
LigandBDBM50437974
Substrate/Competitorn/a
Meas. Tech.ChEMBL_972866 (CHEMBL2411643)
EC50 530±n/a nM
Citation Wen, WWu, WRomaine, IMKaufmann, KDu, YSulikowski, GAWeaver, CDLindsley, CW Discovery of 'molecular switches' within a GIRK activator scaffold that afford selective GIRK inhibitors. Bioorg Med Chem Lett23:4562-6 (2013) 
 
G protein-activated inward rectifier potassium channel 1
Name:G protein-activated inward rectifier potassium channel 1
Type:PROTEIN
Mol. Mass.:56610.74
Organism:Homo sapiens (Human)
Description:ChEMBL_107915
Residue:501
BDBM50437974
NameBDBM50437974
Synonyms:CHEMBL2409128
TypeSmall organic molecule
Emp. Form.C20H19FN4O
Mol. Mass.350.3895
SMILESFc1cccc(NC(=O)Nc2cc(nn2Cc2ccccc2)C2CC2)c1