Reaction Details
TargetG protein-activated inward rectifier potassium channel 1
LigandBDBM50437982
Substrate/Competitorn/a
Meas. Tech.ChEMBL_972866 (CHEMBL2411643)
EC50 460±n/a nM
Citation Wen, WWu, WRomaine, IMKaufmann, KDu, YSulikowski, GAWeaver, CDLindsley, CW Discovery of 'molecular switches' within a GIRK activator scaffold that afford selective GIRK inhibitors. Bioorg Med Chem Lett23:4562-6 (2013) 
 
G protein-activated inward rectifier potassium channel 1
Name:G protein-activated inward rectifier potassium channel 1
Type:PROTEIN
Mol. Mass.:56610.74
Organism:Homo sapiens (Human)
Description:ChEMBL_107915
Residue:501
BDBM50437982
NameBDBM50437982
Synonyms:CHEMBL2409107
TypeSmall organic molecule
Emp. Form.C13H11F5N4O
Mol. Mass.334.2447
SMILESCc1cc(NC(=O)Nc2ccc(F)c(F)c2)n(CC(F)(F)F)n1