Reaction Details
TargetG protein-activated inward rectifier potassium channel 4
LigandBDBM50437959
Substrate/Competitorn/a
Meas. Tech.ChEMBL_972867 (CHEMBL2411644)
IC50 1300±n/a nM
Citation Wen, WWu, WRomaine, IMKaufmann, KDu, YSulikowski, GAWeaver, CDLindsley, CW Discovery of 'molecular switches' within a GIRK activator scaffold that afford selective GIRK inhibitors. Bioorg Med Chem Lett23:4562-6 (2013) 
 
G protein-activated inward rectifier potassium channel 4
Name:G protein-activated inward rectifier potassium channel 4
Type:PROTEIN
Mol. Mass.:47658.06
Organism:Homo sapiens (Human)
Description:ChEMBL_107914
Residue:419
BDBM50437959
NameBDBM50437959
Synonyms:CHEMBL2409123
TypeSmall organic molecule
Emp. Form.C20H19F3N4O
Mol. Mass.388.3863
SMILESCC(C)c1cc(NC(=O)Nc2cccc(c2)C(F)(F)F)n(n1)-c1ccccc1