Reaction Details
TargetG protein-activated inward rectifier potassium channel 1
LigandBDBM50437987
Substrate/Competitorn/a
Meas. Tech.ChEMBL_972869 (CHEMBL2411646)
IC50 1400±n/a nM
Citation Wen, WWu, WRomaine, IMKaufmann, KDu, YSulikowski, GAWeaver, CDLindsley, CW Discovery of 'molecular switches' within a GIRK activator scaffold that afford selective GIRK inhibitors. Bioorg Med Chem Lett23:4562-6 (2013) 
 
G protein-activated inward rectifier potassium channel 1
Name:G protein-activated inward rectifier potassium channel 1
Type:PROTEIN
Mol. Mass.:56610.74
Organism:Homo sapiens (Human)
Description:ChEMBL_107915
Residue:501
BDBM50437987
NameBDBM50437987
Synonyms:CHEMBL2409102
TypeSmall organic molecule
Emp. Form.C20H19ClN4O
Mol. Mass.366.844
SMILESClc1cccc(NC(=O)Nc2cc(nn2-c2ccccc2)C2CCC2)c1