Reaction Details
TargetKallikrein-14
LigandBDBM51911
Substrate/Competitorn/a
Meas. Tech.ChEMBL_973067 (CHEMBL2412648)
IC50 970±n/a nM
Citation Tan, XFurio, LReboud-Ravaux, MVilloutreix, BOHovnanian, AEl Amri, C 1,2,4-Triazole derivatives as transient inactivators of kallikreins involved in skin diseases. Bioorg Med Chem Lett23:4547-51 (2013) 
 
Kallikrein-14
Name:Kallikrein-14
Type:PROTEIN
Mol. Mass.:29136.99
Organism:Homo sapiens (Human)
Description:ChEMBL_1282452
Residue:267
BDBM51911
NameBDBM51911
Synonyms:(4-isopropoxybenzyl)-[3-(2-methoxyphenyl)-3-(4-methoxyphenyl)propyl]amine 3-(2-methoxyphenyl)-3-(4-methoxyphenyl)-N-[(4-propan-2-yloxyphenyl)methyl]propan-1-amine SMR000539687 | cid_3730081
TypeSmall organic molecule
Emp. Form.C27H33NO3
Mol. Mass.419.5558
SMILESCOc1ccc(cc1)C(CCNCc1ccc(OC(C)C)cc1)c1ccccc1OC