Reaction Details
TargetDihydrofolate reductase
LigandBDBM50438440
Substrate/Competitorn/a
Meas. Tech.ChEMBL_975943 (CHEMBL2415592)
IC50 10000±n/a nM
Citation Hassan, GSEl-Messery, SMAl-Omary, FAAl-Rashood, STShabayek, MIAbulfadl, YSHabib, el-SEEl-Hallouty, SMFayad, WMohamed, KMEl-Menshawi, BSEl-Subbagh, HI Nonclassical antifolates, part 4. 5-(2-aminothiazol-4-yl)-4-phenyl-4H-1,2,4-triazole-3-thiols as a new class of DHFR inhibitors: synthesis, biological evaluation and molecular modeling study. Eur J Med Chem66:135-45 (2013) 
 
Dihydrofolate reductase
Name:Dihydrofolate reductase
Type:Enzyme
Mol. Mass.:21603.71
Organism:Bos taurus (Cattle)
Description:P00376
Residue:187
BDBM50438440
NameBDBM50438440
Synonyms:CHEMBL2414371
TypeSmall organic molecule
Emp. Form.C19H16N6S3
Mol. Mass.424.566
SMILESCc1ccc(cc1)-n1c(n[nH]c1=S)-c1csc(NC(=S)Nc2ccccc2)n1