Reaction Details
TargetHypoxanthine-guanine phosphoribosyltransferase
LigandBDBM50438480
Substrate/Competitorn/a
Meas. Tech.ChEMBL_976205 (CHEMBL2415854)
Ki>10000±n/a nM
Citation Clinch, KCrump, DREvans, GBHazleton, KZMason, JMSchramm, VLTyler, PC Acyclic phosph(on)ate inhibitors of Plasmodium falciparum hypoxanthine-guanine-xanthine phosphoribosyltransferase. Bioorg Med Chem21:5629-46 (2013) 
 
Hypoxanthine-guanine phosphoribosyltransferase
Name:Hypoxanthine-guanine phosphoribosyltransferase
Type:Protein
Mol. Mass.:24579.61
Organism:Homo sapiens (Human)
Description:P00492
Residue:218
BDBM50438480
NameBDBM50438480
Synonyms:CHEMBL2414635
TypeSmall organic molecule
Emp. Form.C11H17N4O5P
Mol. Mass.316.2502
SMILESOCC(CNCc1c[nH]c2c1nc[nH]c2=O)CP(O)(O)=O