Reaction Details
TargetCytochrome P450 11B2, mitochondrial
LigandBDBM50438999
Substrate/Competitorn/a
Meas. Tech.ChEMBL_979127 (CHEMBL2421742)
IC50 25±n/a nM
Citation Pinto-Bazurco Mendieta, MAHu, QEngel, MHartmann, RW Highly potent and selective nonsteroidal dual inhibitors of CYP17/CYP11B2 for the treatment of prostate cancer to reduce risks of cardiovascular diseases. J Med Chem56:6101-7 (2013) 
 
Cytochrome P450 11B2, mitochondrial
Name:Cytochrome P450 11B2, mitochondrial
Type:Protein
Mol. Mass.:57582.15
Organism:Homo sapiens (Human)
Description:P19099
Residue:503
BDBM50438999
NameBDBM50438999
Synonyms:CHEMBL2420678
TypeSmall organic molecule
Emp. Form.C15H9ClFNO
Mol. Mass.273.689
SMILESOc1ccc2ccc(-c3cccnc3)c(Cl)c2c1F