Reaction Details
TargetShort transient receptor potential channel 6
LigandBDBM50439218
Substrate/Competitorn/a
Meas. Tech.ChEMBL_978640 (CHEMBL2422303)
IC50 4.0±n/a nM
Citation Washburn, DGHolt, DADodson, JMcAtee, JJTerrell, LRBarton, LManns, SWaszkiewicz, APritchard, CGillie, DJMorrow, DMDavenport, EALozinskaya, IMGuss, JBasilla, JBNegron, LKKlein, MWillette, RNFries, REJensen, TCXu, XSchnackenberg, CGMarino, JP The discovery of potent blockers of the canonical transient receptor channels, TRPC3 and TRPC6, based on an anilino-thiazole pharmacophore. Bioorg Med Chem Lett23:4979-84 (2013) 
 
Short transient receptor potential channel 6
Name:Short transient receptor potential channel 6
Type:PROTEIN
Mol. Mass.:106326.67
Organism:Homo sapiens (Human)
Description:ChEMBL_107640
Residue:931
BDBM50439218
NameBDBM50439218
Synonyms:CHEMBL2418809
TypeSmall organic molecule
Emp. Form.C18H19ClFN3O3S
Mol. Mass.411.878
SMILESCC1CCCN(C1C)C(=O)c1nc(Nc2cc3OCOc3cc2F)sc1Cl