Reaction Details
TargetP2Y purinoceptor 12
LigandBDBM50439274
Substrate/Competitorn/a
Meas. Tech.ChEMBL_977532 (CHEMBL2423149)
IC50 7.0±n/a nM
Citation Bach, PAntonsson, TBylund, RBjörkman, JAÖsterlund, KGiordanetto, Fvan Giezen, JJAndersen, SMZachrisson, HZetterberg, F Lead optimization of ethyl 6-aminonicotinate acyl sulfonamides as antagonists of the P2Y12 receptor. separation of the antithrombotic effect and bleeding for candidate drug AZD1283. J Med Chem56:7015-24 (2013) 
 
P2Y purinoceptor 12
Name:P2Y purinoceptor 12
Type:Enzyme
Mol. Mass.:39458.48
Organism:Homo sapiens (Human)
Description:Q9H244
Residue:342
BDBM50439274
NameBDBM50439274
Synonyms:CHEMBL2419493
TypeSmall organic molecule
Emp. Form.C24H28N4O5S
Mol. Mass.484.568
SMILESCCOC(=O)c1cc(C#N)c(nc1C)N1CCC(CC1)C(=O)NS(=O)(=O)Cc1ccc(C)cc1