Reaction Details
TargetP2Y purinoceptor 12
LigandBDBM50439281
Substrate/Competitorn/a
Meas. Tech.ChEMBL_977532 (CHEMBL2423149)
IC50 17±n/a nM
Citation Bach, PAntonsson, TBylund, RBjörkman, JAÖsterlund, KGiordanetto, Fvan Giezen, JJAndersen, SMZachrisson, HZetterberg, F Lead optimization of ethyl 6-aminonicotinate acyl sulfonamides as antagonists of the P2Y12 receptor. separation of the antithrombotic effect and bleeding for candidate drug AZD1283. J Med Chem56:7015-24 (2013) 
 
P2Y purinoceptor 12
Name:P2Y purinoceptor 12
Type:Enzyme
Mol. Mass.:39458.48
Organism:Homo sapiens (Human)
Description:Q9H244
Residue:342
BDBM50439281
NameBDBM50439281
Synonyms:CHEMBL2419501
TypeSmall organic molecule
Emp. Form.C21H22N4O5S
Mol. Mass.442.488
SMILESCCOC(=O)c1cc(C#N)c(nc1C)N1CC(C1)C(=O)NS(=O)(=O)Cc1ccccc1