Reaction Details
TargetCoagulation factor X
LigandBDBM50038001
Substrate/Competitorn/a
Meas. Tech.ChEMBL_978319 (CHEMBL2424100)
Ki 53000±n/a nM
Citation Park, HDLee, SHKim, THLee, SHCho, KHKim, A Antithrombotic effects of LB30870, a potent, orally active, selective and direct thrombin inhibitor, and pharmacokinetics of its prodrug. Bioorg Med Chem Lett23:4779-84 (2013) 
 
Coagulation factor X
Name:Coagulation factor X
Type:Enzyme
Mol. Mass.:54726.60
Organism:Homo sapiens (Human)
Description:n/a
Residue:488
BDBM50038001
NameBDBM50038001
Synonyms:(2R,4R)-1-((S)-5-(diaminomethyleneamino)-2-(3-methyl-1,2,3,4-tetrahydroquinoline-8-sulfonamido)pentanoyl)-4-methylpiperidine-2-carboxylic acid (2R,4S)-1-[5-Guanidino-2-(3-methyl-1,2,3,4-tetrahydro-quinoline-8-sulfonylamino)-pentanoyl]-4-methyl-piperidine-2-carboxylic acid (S)-1-[5-Guanidino-2-(3-methyl-1,2,3,4-tetrahydro-quinoline-8-sulfonylamino)-pentanoyl]-4-methyl-piperidine-2-carboxylic acid 1-[5-Guanidino-2-(3-methyl-1,2,3,4-tetrahydro-quinoline-8-sulfonylamino)-pentanoyl]-4-methyl-piperidine-2-carboxylic acid ARGATROBAN DK-7419 MCI-9038 | MD-805
TypeSmall organic molecule
Emp. Form.C23H36N6O5S
Mol. Mass.508.634
SMILESC[C@@H]1CCN([C@H](C1)C(O)=O)C(=O)[C@H](CCCNC(N)=N)NS(=O)(=O)c1cccc2CC(C)CNc12