Reaction Details
TargetMitogen-activated protein kinase 1
LigandBDBM50439463
Substrate/Competitorn/a
Meas. Tech.ChEMBL_978338 (CHEMBL2424119)
IC50 38000±n/a nM
Citation Allen, CEChow, CLCaldwell, JJWestwood, IMvan Montfort, RLCollins, I Synthesis and evaluation of heteroaryl substituted diazaspirocycles as scaffolds to probe the ATP-binding site of protein kinases. Bioorg Med Chem21:5707-24 (2013) 
 
Mitogen-activated protein kinase 1
Name:Mitogen-activated protein kinase 1
Type:Ser/Thr Protein Kinase
Mol. Mass.:41392.76
Organism:Homo sapiens (Human)
Description:P28482
Residue:360
BDBM50439463
NameBDBM50439463
Synonyms:CHEMBL2420911
TypeSmall organic molecule
Emp. Form.C14H20N6
Mol. Mass.272.3488
SMILESC1CNCC2(C1)CCN(CC2)c1ncnc2nc[nH]c12