Reaction Details
TargetSerine/threonine-protein kinase D2
LigandBDBM50439463
Substrate/Competitorn/a
Meas. Tech.ChEMBL_978342 (CHEMBL2424123)
IC50 1300±n/a nM
Citation Allen, CEChow, CLCaldwell, JJWestwood, IMvan Montfort, RLCollins, I Synthesis and evaluation of heteroaryl substituted diazaspirocycles as scaffolds to probe the ATP-binding site of protein kinases. Bioorg Med Chem21:5707-24 (2013) 
 
Serine/threonine-protein kinase D2
Name:Serine/threonine-protein kinase D2
Type:Protein
Mol. Mass.:96755.22
Organism:Homo sapiens (Human)
Description:Q9BZL6
Residue:878
BDBM50439463
NameBDBM50439463
Synonyms:CHEMBL2420911
TypeSmall organic molecule
Emp. Form.C14H20N6
Mol. Mass.272.3488
SMILESC1CNCC2(C1)CCN(CC2)c1ncnc2nc[nH]c12