Reaction Details
TargetN-acylethanolamine-hydrolyzing acid amidase
LigandBDBM50439649
Substrate/Competitorn/a
Meas. Tech.ChEMBL_978419 (CHEMBL2421061)
IC50 5.0±n/a nM
Citation Ponzano, SBertozzi, FMengatto, LDionisi, MArmirotti, ARomeo, EBerteotti, AFiorelli, CTarozzo, GReggiani, ADuranti, ATarzia, GMor, MCavalli, APiomelli, DBandiera, T Synthesis and structure-activity relationship (SAR) of 2-methyl-4-oxo-3-oxetanylcarbamic acid esters, a class of potent N-acylethanolamine acid amidase (NAAA) inhibitors. J Med Chem56:6917-34 (2013) 
 
N-acylethanolamine-hydrolyzing acid amidase
Name:N-acylethanolamine-hydrolyzing acid amidase
Type:Enzyme
Mol. Mass.:40073.12
Organism:Homo sapiens (Human)
Description:Q02083
Residue:359
BDBM50439649
NameBDBM50439649
Synonyms:CHEMBL2419811 | US9353075, 7
TypeSmall organic molecule
Emp. Form.C14H25NO4
Mol. Mass.271.3526
SMILESCCCCCCC[C@H](C)OC(=O)N[C@@H]1[C@H](C)OC1=O