Reaction Details
TargetN-acylethanolamine-hydrolyzing acid amidase
LigandBDBM50439664
Substrate/Competitorn/a
Meas. Tech.ChEMBL_978417 (CHEMBL2421059)
IC50 7.0±n/a nM
Citation Ponzano, SBertozzi, FMengatto, LDionisi, MArmirotti, ARomeo, EBerteotti, AFiorelli, CTarozzo, GReggiani, ADuranti, ATarzia, GMor, MCavalli, APiomelli, DBandiera, T Synthesis and structure-activity relationship (SAR) of 2-methyl-4-oxo-3-oxetanylcarbamic acid esters, a class of potent N-acylethanolamine acid amidase (NAAA) inhibitors. J Med Chem56:6917-34 (2013) 
 
N-acylethanolamine-hydrolyzing acid amidase
Name:N-acylethanolamine-hydrolyzing acid amidase
Type:Enzyme
Mol. Mass.:40306.53
Organism:Rattus norvegicus (Rat)
Description:Q5KTC7
Residue:362
BDBM50439664
NameBDBM50439664
Synonyms:CHEMBL2419814 | US9353075, 17
TypeSmall organic molecule
Emp. Form.C18H17NO4
Mol. Mass.311.3319
SMILESC[C@@H]1OC(=O)[C@@H]1NC(=O)OCc1ccc(cc1)-c1ccccc1