Reaction Details
TargetPhosphatidylinositol 4,5-bisphosphate 3-kinase catalytic subunit alpha isoform
LigandBDBM50439729
Substrate/Competitorn/a
Meas. Tech.ChEMBL_979671 (CHEMBL2421354)
IC50 110±n/a nM
Citation Pecchi, SNi, ZJHan, WSmith, ALan, JBurger, MMerritt, HWiesmann, MChan, JKaufman, SKnapp, MSJanssen, JHuh, KVoliva, CF Structure guided optimization of a fragment hit to imidazopyridine inhibitors of PI3K. Bioorg Med Chem Lett23:4652-6 (2013) 
 
Phosphatidylinositol 4,5-bisphosphate 3-kinase catalytic subunit alpha isoform
Name:Phosphatidylinositol 4,5-bisphosphate 3-kinase catalytic subunit alpha isoform
Type:Enzyme Subunit
Mol. Mass.:124294.87
Organism:Homo sapiens (Human)
Description:P42336
Residue:1068
BDBM50439729
NameBDBM50439729
Synonyms:CHEMBL2418961
TypeSmall organic molecule
Emp. Form.C14H11N3OS
Mol. Mass.269.322
SMILESCC(=O)Nc1nc2ccc(cc2s1)-c1cccnc1