Reaction Details
TargetHypoxanthine-guanine phosphoribosyltransferase
LigandBDBM50439834
Substrate/Competitorn/a
Meas. Tech.ChEMBL_978181 (CHEMBL2423189)
Ki 3700±n/a nM
Citation Baszczynski, OHocková, DJaneba, ZHolý, AJansa, PDracínský, MKeough, DTGuddat, LW The effect of novel [3-fluoro-(2-phosphonoethoxy)propyl]purines on the inhibition of Plasmodium falciparum, Plasmodium vivax and human hypoxanthine-guanine-(xanthine) phosphoribosyltransferases. Eur J Med Chem67:81-9 (2013) 
 
Hypoxanthine-guanine phosphoribosyltransferase
Name:Hypoxanthine-guanine phosphoribosyltransferase
Type:Protein
Mol. Mass.:24579.61
Organism:Homo sapiens (Human)
Description:P00492
Residue:218
BDBM50439834
NameBDBM50439834
Synonyms:CHEMBL2420081
TypeSmall organic molecule
Emp. Form.C10H15FN5O5P
Mol. Mass.335.2288
SMILESNc1nc2n(CC(CF)OCCP(O)(O)=O)cnc2c(=O)[nH]1