Reaction Details
TargetDNA-dependent protein kinase catalytic subunit
LigandBDBM50439947
Substrate/Competitorn/a
Meas. Tech.ChEMBL_978844 (CHEMBL2423446)
IC50 5±n/a nM
Citation Cano, CSaravanan, KBailey, CBardos, JCurtin, NJFrigerio, MGolding, BTHardcastle, IRHummersone, MGMenear, KANewell, DRRichardson, CJShea, KSmith, GCThommes, PTing, AGriffin, RJ 1-substituted (Dibenzo[b,d]thiophen-4-yl)-2-morpholino-4H-chromen-4-ones endowed with dual DNA-PK/PI3-K inhibitory activity. J Med Chem56:6386-401 (2013) 
 
DNA-dependent protein kinase catalytic subunit
Name:DNA-dependent protein kinase catalytic subunit
Type:Protein
Mol. Mass.:469114.78
Organism:Homo sapiens (Human)
Description:P78527
Residue:4128
BDBM50439947
NameBDBM50439947
Synonyms:CHEMBL2420310
TypeSmall organic molecule
Emp. Form.C33H34N4O5S
Mol. Mass.598.712
SMILESOCCN1CCN(CC(=O)Nc2ccc(-c3cccc4c3oc(cc4=O)N3CCOCC3)c3sc4ccccc4c23)CC1