Reaction Details
TargetDNA-dependent protein kinase catalytic subunit
LigandBDBM50319926
Substrate/Competitorn/a
Meas. Tech.ChEMBL_978834 (CHEMBL2423436)
EC50 136±n/a nM
Citation Cano, CSaravanan, KBailey, CBardos, JCurtin, NJFrigerio, MGolding, BTHardcastle, IRHummersone, MGMenear, KANewell, DRRichardson, CJShea, KSmith, GCThommes, PTing, AGriffin, RJ 1-substituted (Dibenzo[b,d]thiophen-4-yl)-2-morpholino-4H-chromen-4-ones endowed with dual DNA-PK/PI3-K inhibitory activity. J Med Chem56:6386-401 (2013) 
 
DNA-dependent protein kinase catalytic subunit
Name:DNA-dependent protein kinase catalytic subunit
Type:Protein
Mol. Mass.:469114.78
Organism:Homo sapiens (Human)
Description:P78527
Residue:4128
BDBM50319926
NameBDBM50319926
Synonyms:2-(4-ethylpiperazin-1-yl)-N-(4-(2-morpholino-4-oxo-4H-chromen-8-yl)dibenzo[b,d]thiophen-1-yl)acetamide KU-0060648
TypeSmall organic molecule
Emp. Form.C33H34N4O4S
Mol. Mass.582.712
SMILESCCN1CCN(CC(=O)Nc2ccc(-c3cccc4c3oc(cc4=O)N3CCOCC3)c3sc4ccccc4c23)CC1