Reaction Details
TargetSerine/threonine-protein kinase mTOR
LigandBDBM12915
Substrate/Competitorn/a
Meas. Tech.ChEMBL_978826 (CHEMBL2423428)
IC50 2800±n/a nM
Citation Cano, CSaravanan, KBailey, CBardos, JCurtin, NJFrigerio, MGolding, BTHardcastle, IRHummersone, MGMenear, KANewell, DRRichardson, CJShea, KSmith, GCThommes, PTing, AGriffin, RJ 1-substituted (Dibenzo[b,d]thiophen-4-yl)-2-morpholino-4H-chromen-4-ones endowed with dual DNA-PK/PI3-K inhibitory activity. J Med Chem56:6386-401 (2013) 
 
Serine/threonine-protein kinase mTOR
Name:Serine/threonine-protein kinase mTOR
Type:Rapamycin target protein
Mol. Mass.:288917.12
Organism:Homo sapiens (Human)
Description:P42345
Residue:2549
BDBM12915
NameBDBM12915
Synonyms:2-(4-Morpholinyl)-8-phenyl-4H-1-benzopyran-4-one CHEMBL98350 US10308662, Compound LY294002 | US9505780, LY294002
TypeSmall organic molecule
Emp. Form.C19H17NO3
Mol. Mass.307.3432
SMILESO=c1cc(oc2c(cccc12)-c1ccccc1)N1CCOCC1