Reaction Details
TargetSerine/threonine-protein kinase 16
LigandBDBM50440018
Substrate/Competitorn/a
Meas. Tech.ChEMBL_982224 (CHEMBL2429167)
Kd 450±n/a nM
Citation Palmer, WSAlam, MArzeno, HBChang, KCDunn, JPGoldstein, DMGong, LGoyal, BHermann, JCHogg, JHHsieh, GJahangir, AJanson, CJin, SUrsula Kammlott, RKuglstatter, ALukacs, CMichoud, CNiu, LReuter, DCShao, ASilva, TTrejo-Martin, TAStein, KTan, YCTivitmahaisoon, PTran, PWagner, PWeller, PWu, SY Development of amino-pyrimidine inhibitors of c-Jun N-terminal kinase (JNK): kinase profiling guided optimization of a 1,2,3-benzotriazole lead. Bioorg Med Chem Lett23:1486-92 (2013) 
 
Serine/threonine-protein kinase 16
Name:Serine/threonine-protein kinase 16
Type:Protein
Mol. Mass.:34659.07
Organism:Homo sapiens (Human)
Description:n/a
Residue:305
BDBM50440018
NameBDBM50440018
Synonyms:CHEMBL2425628
TypeSmall organic molecule
Emp. Form.C28H37N5O5S
Mol. Mass.555.689
SMILESCS(=O)(=O)CCCOc1cccc2n(ccc12)-c1ccnc(N[C@H]2CC[C@@H](CC2)C(=O)N2CCC(O)CC2)n1