Reaction Details
TargetAtypical kinase COQ8B, mitochondrial
LigandBDBM50440018
Substrate/Competitorn/a
Meas. Tech.ChEMBL_982261 (CHEMBL2429328)
Kd 4800±n/a nM
Citation Palmer, WSAlam, MArzeno, HBChang, KCDunn, JPGoldstein, DMGong, LGoyal, BHermann, JCHogg, JHHsieh, GJahangir, AJanson, CJin, SUrsula Kammlott, RKuglstatter, ALukacs, CMichoud, CNiu, LReuter, DCShao, ASilva, TTrejo-Martin, TAStein, KTan, YCTivitmahaisoon, PTran, PWagner, PWeller, PWu, SY Development of amino-pyrimidine inhibitors of c-Jun N-terminal kinase (JNK): kinase profiling guided optimization of a 1,2,3-benzotriazole lead. Bioorg Med Chem Lett23:1486-92 (2013) 
 
Atypical kinase COQ8B, mitochondrial
Name:Atypical kinase COQ8B, mitochondrial
Type:PROTEIN
Mol. Mass.:60073.32
Organism:Homo sapiens (Human)
Description:ChEMBL_586944
Residue:544
BDBM50440018
NameBDBM50440018
Synonyms:CHEMBL2425628
TypeSmall organic molecule
Emp. Form.C28H37N5O5S
Mol. Mass.555.689
SMILESCS(=O)(=O)CCCOc1cccc2n(ccc12)-c1ccnc(N[C@H]2CC[C@@H](CC2)C(=O)N2CCC(O)CC2)n1