Reaction Details
TargetG-protein coupled estrogen receptor 1
LigandBDBM17292
Substrate/Competitorn/a
Meas. Tech.ChEMBL_982507 (CHEMBL2427815)
Ki 5.7±n/a nM
Citation Huryn, DMResnick, LOWipf, P Contributions of academic laboratories to the discovery and development of chemical biology tools. J Med Chem56:7161-76 (2013) 
 
G-protein coupled estrogen receptor 1
Name:G-protein coupled estrogen receptor 1
Type:PROTEIN
Mol. Mass.:42259.21
Organism:Homo sapiens (Human)
Description:ChEMBL_982507
Residue:375
BDBM17292
NameBDBM17292
Synonyms:(1S,10R,11S,14S,15S)-15-methyltetracyclo[8.7.0.0^{2,7}.0^{11,15}]heptadeca-2,4,6-triene-5,14-diol 17α-ethinylestradiol CHEMBL135 ESTRADIOL Ovocyclin US9040509, E2 US9561238, E2 [2,4,6,7-3H]-E2 [3H]]estradiol
TypeSteroid
Emp. Form.C18H24O2
Mol. Mass.272.382
SMILES[H][C@@]12CC[C@H](O)[C@@]1(C)CC[C@]1([H])c3ccc(O)cc3CC[C@@]21[H]