Reaction Details
TargetGlutamate receptor ionotropic, NMDA 2B
LigandBDBM50440049
Substrate/Competitorn/a
Meas. Tech.ChEMBL_983747 (CHEMBL2427900)
IC50 152000±n/a nM
Citation Acker, TMKhatri, AVance, KMSlabber, CBacsa, JSnyder, JPTraynelis, SFLiotta, DC Structure-activity relationships and pharmacophore model of a noncompetitive pyrazoline containing class of GluN2C/GluN2D selective antagonists. J Med Chem56:6434-56 (2013) 
 
Glutamate receptor ionotropic, NMDA 2B
Name:Glutamate receptor ionotropic, NMDA 2B
Type:Protein
Mol. Mass.:166077.66
Organism:Rattus norvegicus (Rat)
Description:Q00960
Residue:1482
BDBM50440049
NameBDBM50440049
Synonyms:CHEMBL2425974
TypeSmall organic molecule
Emp. Form.C29H24ClN3O5
Mol. Mass.529.971
SMILESCOc1cccc(c1)-c1c(C2=NN(C(C2)c2ccc(Cl)cc2)C(=O)CCC(O)=O)c(=O)[nH]c2ccccc12